"Could not delete path" on various folders under "build/generated/source/r"

access Hide Error in gradle file while updating

Android build variant not working with different flavors

Execute multiple tasks before assembleRelease

How to populate Gradle cache in a Docker image?

How do I have to fix merging dex build error?

Could not find com.android.tools.lint:lint-gradle:26.1.4. Searched in the following locations:

How to generate R file correctly with Gradle while I only put resources under src/test

Failed to resolve: livedata-core

Avoid AndroidX Jetifier log spam

Unknown constant tag 114 in class file

I'm Tried To Solve - Program type already present: android.support.v4.accessibilityservice.AccessibilityServiceInfoCompat

android studio cannot find specified file

I am facing 'Gradle project sync failed' error

Gradle couldn't build successfully

How to access BuildConfig product flavor variables in React native android

appcompat lib error while implementing google maps

Broken pipe java.io.IOException: Broken pipe

Android studio gradle synchronization

Cannot invoke method containsKey() on null object

Problem with gradle build flavour and packagingOptions

Why does Gradle starts to build each time a new Activity or Fragment is created?

Could not resolve android.arch.lifecycle:extensions:1.1.0

My project is not running after i add the following dependencies

Android Target and Compiled SDK version for Android OREO (API26 or API27)

Android Studio Update setDependencyCacheDir error

installing android studio 27.0.3

How to fix error:Cause: unable to find valid certification path to requested target

Removing unused alternative resources with resConfigs increases app size

Could not resolve dependency for 'com.google.firebase:firebase-auth:16.0.3'

gradle-1.22.2.pom is missing from the repo?

Ionic v1 Build Failed in android

Android | Can't build multi flavorDimension

Is there any multiDexEnabled behavior difference in debug and release mode?

Getting error when I use same version dependencies in gradle

Android Emulator and Genymotion Emulator opens but cannot deploy my Application

I've got an error when I added the truetime library in android

Gradle error while adding the dependencies CardView and RecylerView

Android Stripe integration

how to get different gms libraries included?

Cannot add task ':app:reportSourceSetTransformTest' as a task with that name already exists

All com.android.support libraries must use the exact same version specification although using same version

Android Build Error: Attribute Signature requires InnerClasses attribute. Check -keepattributes directive

Gradle Build error : com.couchbase.lite:couchbase-lite-android:2.1.0

Cannot access zzbfm class file for com.google.android.gms.internal.zzbfm not found

Android build error Cannot compute meet of types: FLOAT and INT

Proguard error while signing APK with Android Studio

Android support libraries - exact same vs mixed versions

update app gradle API to target level 26 fails nes app

External reference/variable in build.gradle file

How to change path to android SDK in Qt Creator from /opt/android/sdk to something else?

Conflicts in "System.Net.Http" that could not be resolved resulting in INSTALL_FAILED_NO_MATCHING_ABIS

failed to notify build listener (when trying to build a library)

java.lang.UnsatisfiedLinkError: couldn't find "libBapi.so"

Gradle Sync failing on new project Unexpected ZLIB Input Stream

Where does gradlew look for an Android SDK?

Gradle TransitiveDependency Version Conflict

Android Gradle Plugin 3.1 giving error in Merged manifest while running instant run

Error to Build Gradle when I Updating sdk versions

Errors 'Root project path of the Gradle project not found for Module: 'Pegboard'' and 'Failed to notify project evaluation listener'

error: cannot access MapView class file for com.esri.android.map.MapView not found

android studio 3.1.4 offline mode

Gradle sync fails with 'Cause: unable to find valid certification path to requested target'

With Android gradle plugin 3.1.0 is it still best to manually specify the android build tools?

Updating gradle version from 2.2.3 to 3.0.1 breaks react-native-mailcore library

Migrate project to gradle file??This project does not use Gradle build system.We recommend that you migrate to using Gradle build system

Accessing classes of dependent modules of dependent modules in gradle

No toolchains found in the NDK toolchains folder for ABI with prefix: mips64el-linux-android

Failed to resolve: com.android.support after building gradle but my app can still be installed

In Gradle, how do I make my androidTest implementation use the release version of a project module?

Build Gradle require internet connection

Execution failed for task ':app:compileDebugJavaWithJavac

After upgrade Play Services to 15.0.0 having MergerException: Unable to merge dex

Gradle dependency issue with com.squareup.okhttp3 library

Flutter in android simulator gives error : Could not resolve all files for configuration

DexArchiveBuilderException: Failed to process /xxx/.gradle/caches/transforms-1/files-1.1/play-services-location-11.2.2.aar

Unable to delete directory: apollo-codegen

Migration to androidX - can't import/find androidx.databinding.DatabindingUtil

Failed to resolve: support-fragment

Excluding the same group from multiple dependencies in gradle?

Difference between implementation project (lib_name) & (path,config) in Android

Gradle Dependency Conflict, Version for app 26.1.0 and test app 27.1.1

Application runs into ANR before having App onCreate() called

Library is being requested by various other libraries at [[15.0.2,15.0.2]

How to fix (apparently invisible) dependency conflict on Gradle?

Android resource compilation failed (cache file error )

How to hardcode actual path to a maven repository in Gradle, Android?

Gradle module dependency not found

React-native android-studio code completion

Error : minimum supported gradle version is 4.6 in android studio 3.0.1

Unity Gradle Build Failed. DexException: Multiple dex files define

Can't build the app getting AAPT2 error: check logs for details error when running the app

Either can't install or import Volley in Android Studio

error: attribute 'com.xyz.abc:itemBackground' not found

Program type already present: com.android.volley.Cache$Entry

The pace of starting of gradle kapt tasks for project with dagger

How to run a gradle task in a loop for each file with specific extension?

Prevent two processes Android Studio initializes when building Android applications from executing

What is configFile() and how is it different from file() in Android Lint?

Grandle project sync failed in Android studio3.1.3- WIndows 10