How do I import com.android.support.test.espresso.contrib ? I have added the required dependencies and yet it says Cannot resolve symbol contrib?

Targeting Android API 26, causes jenkins robolectric unit tests to stall

How to call custom groovy method from build.gradle in Java/Kotlin Android?

Could not download kotlin-compiler.jar, Android issue

Error in gradle.build "should not contain a package statement."

can not rebuild project and build APK in Android Studio

How to use pom file in Android Gradle build?

How to call a task inside another gradle task

Not getting preview layout in android studio 3.0

Jenkins Execution failed for task ':app:mergeDebugResources' , file not found

How to access apk generated time in Android Programmatically?

Android resource linking failed due to missing boolean resource values using Jetpack Workflow

Android Studio: Gradle Script faild to sync with the error message - "Failed to resolve: com"

gradle build error when building android project

What can cause the error: Could not find the AndroidManifest.xml file?

Multi-Release jars in gradle

How do I evaluate a string key in Groovy so that it outputs a value?

Gradle multi-module

Unable to start daemon process i have tried many things.. i'm using android 3.0.1

Calling gradle script build.gradle with a setting whether it should build debug/release flavour and write generic tasks?

"Failed to resolve: support-fragment " when building using LiveData dependencies

How do I reflect Java version 10 in my build.gradle

Using Ant Tasks From External Jars in a Gradle taskdef

Could not resolve com.google.firebase:firebase-database:11.8.0

Android Studio: Blank app - Gradle shows unresolved dependencies

Gradle sync failed: Cannot cast object '.../classes/test/release' with class 'java.io.File' to class 'org.gradle.api.file.FileCollection'

java.lang.RuntimeException: Internal error in Firestore (0.6.6-dev) after updating Firestore version

setting properties for Gradle subproject

could not execute build using Gradle installation <gradle directory>

Android support libraries folders do not have newer versions

gradle fails on using flutter in Android Studio

Android app is supported by 0 devices in Play Store

Could not get unknown property 'sonatypeRepo'

React-Native Android Build Failure: Execution failed for task ':app:processDebugResources'. Failed to process resources

React-Native 0.56 how to enable Android gif support with fresco?

Accessing own ClassPATH in plugin

Using google map and FCM in one react-native project

Renaming the UI base Testing .apk files

Gradle set outputDir of java classes

Java.lang.IndexOutOfBoundsException: Invalid index 0, size is 0 Android

Creating an aws lambda java code to put a json to an endpoint url

How to run python script from Gradle?

how to create gradle multi module project using Spring Boot

How to migrate plugin from Maven to Gradle

Process 'command 'Sdk\build-tools\25.0.2\aapt.exe'' finished with non-zero exit value 1

Unable to resolve dependency for ':app@debug/compileClasspath': Could not resolve

appcompat-v7:27.1.1 CardView not showing in previous apis

Spring Boot Not Deploying WAR From IntelliJ

Use of flavour dimensions in build.gradle in android studio

Classes provided via Gradle project compile dependency won't be found

gradle ear plugin: how to add xml files with mbean definition?

Error:Program type already present: android.support.compat.R

gradle build failed with "Connect to repo.maven.apache.org:443 [repo.maven.apache.org/151.101.36.215] failed: Connection refused: connect" error

How to manipulate the product flavours of build.gradle through java code

Deploy Annotation Processor library

Error in using android dataBinding

Isolating classpath between interdependent gradle modules

Gradle sync failed: unable to find valid certification path to requested target

Error While Adding library for CardView

Multiple gradle task rules in build.gradle

Program type already present: com.android.volley.BuildConfig

Failed to resolve play-services-auth and firebase-core

error: class MainFeedListAdapter is public, should be declared in a file named MainFeedListAdapter.java

skip database connection with mysql while doing testing in spring boot

Getting NullPointerException when use Mupdf or AndroidPdfViewer

How to add contentRoot to build.gradle

Error:(1, 0) Minimum supported Gradle version is 4.1-rc-1. Current version is 3.3. Please fix the project's Gradle settings

can't find build.gradle in Eclipse projects

java.util.zip.ZipException: duplicate entry: com/google/common/annotations/Beta.class

Getting java.lang.NullPointerException when use Mupdf or AndroidPdfViewer

Exclude gradle tests by default

Gradle build fails with same string name for different product

How to Add and Use an AAR in AndroidStudio Project

"You cannot upload a test-only APK" when building by command line (assemble{Flavor}{Flavor}Release)

Why activity_main.xml screen just white?

Jenkins-IntelliJ Idea Integration

Could not find method implementation() for arguments [directory 'libs'] on object

Could not get unknown property 'natives' for configuration container error

How to make gradle processResources task faster

Could not find method implementation() for arguments [directory 'libs]

Changing minSdkVersion in JavaFXPorts doesn't work

Gradle gets dependency but doesn't use it on build

how to edit unity exported gradle project in android studio (mainly unity's .cs files / scripts)

Error:(1, 0) Minimum supported Gradle version is 4.1-rc-1. Current version is 3.3. Please fix the project's Gradle settings

HOW TO DOWNLOAD GOOGLE SERVICE,?

ionic3: build.gradle files

Could not get unknown property 'natives' for configuration container

Android Studio 500 server error

Error in running git cloned android project

Android Build.gradle sync fails with NoSuchFieldError: FOR_COMPILE

android build gradle error (android 3.1.3) ? Connection timed out: connect

Connection timed out: connect?

Android Studio 3.2 Beta 1 !zip.isFile Error

Gradle project sync failed after update - Unable to find method 'com.google.common.collect.ImmutableSet.toImmutableSet()Ljava/util/stream/Collector;'

How to define inputs or outputs in custom gradle task?

Google Play Services Ads?

ZipException: transform duplicate entry com/google/android/gms/internal/zzez.class

How to exclude gsps from being compiled by compileGroovyPages gradle task?

Android studio referring to build.gradle from incorrect project

Add classpath to build.gradle in cordova plugin