gradle dependencyInsight not displaying transitive dependencies

NativeScript ./gradlew failed with exit code 1

React native: Error executing ./gradlew bundleRelease

What is the difference between gradlew assembleRelease vs gradlew app:assembleRelease?

Why docker image build throws /usr/bin/env: ‘sh\r’: No such file or directory?

Difference between :app:assembleRelease and assembleRelease

How to execute gradle tasks from sublime? Which sublime package to be used?

Gradlew build fail

How do I run a gradlew build using native Android Studio Java

Can not Resolve React Native Camera MLKit Dependencies RN 0.62.0

Execution failed for task ' :clean' when doing the clean build for gradle java

Setting project properites in gradle task for a project

Unable to access the Cordapp flows in service project

java.lang.NoClassDefFoundError: javax/xml/bind/JAXBException

java.lang.IllegalArgumentException coming when executing ./gradlew check for running SOOT

could not find method implementation() for arguments directory 'libs'

Manifest.mf file is not getting picked up while building gradlew

Spring Boot: Jenkins removes escaped double quote character from commands

Apollo-android GraphQL plugin doesn't generate sources with gradle task

Unable to get stack trace for native crashes in Crashlytics

GradleException Could not create ZIP WekaDeeplearning4j

How to solve gradlew publishReleaseBundle not working?

Gradle wont run project if the source code loads a file

gradlew getting 403 on fetching gradle binary

Why "enableBuildCache=true" doesn't work for my Android Studio?

Gradle: Could not determine java version from '11.0.1' - Mac

no known implementation of interface jenkins.tasks.SimpleBuildStep is named

How to correct the classpath of your application so that it contains a single compatible version

Getting errors when runing javafx11 on raspberry pi using gradle

Gradle: initwith don't work for minify and proGuard

Gradle : Cleanup resources after build failure

Missing dependency FreeTypeFontGenerator in fat jar packaged with gradlew

Kotest freezes after migrating to 4.0.0-BETA1 on testDebugUnitTest task

Defining Gradle task

gradlew wrapper update to new version error that you have old version

Run Gradle build offline in a docker container

Several tasks execution

How to debug a Jhipster/Gradle project on Eclipse

gradlew build failed for the task test with clover plugin

How to execute tasks dynamically in Gradle 5?

ionic 3: FAILURE: Build failed with an exception

error in build.gradle.kts script using extra property

Exclude certain files or folders when do gradlew clean task in Gradle?

How to Generate Gradlew on to Jenkins?

Uploaded War or Tar information is not printing on Jenkins console after upgrading to Gradle 6

InitializationError in Android Studio

Task 'publishApkRelease' not found in project ':app'

After APK Generate from React Native than Run on my mobile At a time API is not working

Gradle different results per usecase, fails from terminal, success from android studio

Gradle Getting Access Denied While Publishing Artifact To Bitbucket

How to find out the the definition of gradle executed task in Jenkins

java.lang.NoSuchFieldException erreor from jacoco

Gradle publish artifact to Bitbucket

Flutter- using fastlane with android multi flavors

Android Studio compiles project correctly, Gradlew does not with Databinding enabled

gradlew batch file - how to delete jar file in directory before build

com.android.ddmlib.InstallException: device offline

flutter duplicate class. trying to use admob

react-native run-android error : gradlew.bat on Atom

Error ":app:transformClassesWithDexBuilderForDebug" when upgrade to new version of flutter

Why is gradle bdd command not working in the first run

React Native - Error while running run-android

Gredlew taskname - command not running Android studio terminal

Determine the JVM vendor in Gradle build

Main Java lang Error while debugging Flutter Application

Create Gradle Tasks that executes other gradle task with parameters

How to update in react using Gradlew startServer?

Gradle Shared tasks

Gradle wrapper authenticated download credentials not being picked up from environment

Is AGP 3.5 compatible with Gradle 6?

Executing Gradle tasks as part of an undefined build has been deprecated. This will fail with an error in Gradle 7.0

Bamboo build fails but reports successful completion

Add jar dependency to gradle task without actually including its classes to the output

java.lang.RuntimeException: Cannot start "jarsigner" process, please add it to the PATH

Create Android test APK with specific android espresso tests

Gradle to use a jar-with-dependencies in compile task

Error while building Gradle with Jacoco - failed to init: instrument Process 'Gradle Test Executor 81'

Android unit test unable to resolve class under test after updating gradle

How to use updatepolicy in gradle build

Setting up programming environment for minecraft 1.12 modding, running into gradle decompile error

Gradle - How to get task output from subproject

Sonarqube scan for Gradle with multiple modules

How do I build and run android app from CLI?

Gradle set property in custom task

Continuously not having enough memory setting up Forge

./gradlew tasks returns different results depending on calling directory

Running Gradle on macbook

Gradle 5.4.1 not transforming resource files from dependency jars

Mockito Spring Test Fails When Run as a Gradlew Task

Cannot find executable for C:\Users\Gaurav\Desktop\QR_Code\gogocinema-scanner\android\gradlew.bat

Flutter with FirebaseAppDistribution ignore "--target"

Change extension of NativeLibrarySpec

How to disable "auto-scroll to the bottom of the terminal window" in WSL while running a process?

How to get code coverage in android using command line

Gradle builds every subproject when a unit test is executed

Slow gradle build in Docker. Caching gradle build

gradlew.bat error in downloading gradle-4.10.2-all.zip

Run Unit tests with gradlew and custom JRE

Lint option baseline

Gradle execution failed for task ‘:test’ when changing sourceCompatibility and targetCompatibility from 1.8 to 13