java.lang.Error: Unresolved compilation problems: specialChr and lower case cannot be resolved to a variable

What is the difference between Geb and Spock testing frameworks

How to run e2e tests automatically?

testng-users › how to mark test case as Not applicable in TestNG , Don't want to skip or ignore test case

unable to set data in excel using apache POI in data driven framework

Page not loading after interaction, stuck on blank page even after implicit wait

TestNG - no tests were found

Get Test method name in TestNG/Maven reporting in case of DataProvider running multiple tests with different data for single Test method

unable to install testng in latest eclipse

TestNG. BeforeSuite is not executed

Retry a specific piece of code in a TestNG code if the test fails, not the whole test

how to use expectedExceptionsMessageRegExp inside test method

Execute testng xml using java main method in specified folder structure

How do I get the console output out of my testng report?

How to get WebElement in ItestListener

TestNG - Factory - not able to save factory parameters for later use

Need to run suite.xml through Main.class

failed to get TestNG version from class: java.lang.ClassNotFoundException: org.testng.internal.Version

Tests with Cucumber + Maven + TestNG not running

How to access the resource files that are kept under resources folder

How add Reporter.log() to log on Jenkins?

Best approach for doing test case clean up for testng based frameworks

How do I re run failed Cucumber scenarios from Maven?

Extent report is Save only the last one results of the last one job in Jenkins

Return Environment variable from a Java function and set the same in Jenkins for running builds

How to run the SuiteTest many times in testNG file

Run script with specific data iteration

Element is not clickable at this point error and warning

Unable to call a test method from another test class in selenium using page factory

how find iframe in aem to do selenium page object model framework

TestNG parallel execution reports test cases as Skipped

Unable to view screen shot in Extent Report

What's the difference between mockitoSession and MockitoAnnotations.initMocks

How can i invoke parallel browsers from different machines using selenium grid?

Loading different integrations from properties file

Can I use Maven to generate a Jar that i can run my different Selenium TestNG tests using different testng xmls

Allure TestNG: Custom test method names while using @DataProvider

Failed Configuration - Null point Exception

Generating screenshots in Java&TestNG with Allure reporting

How to use system environment variables instead configuration.properties in automation framework?

Send mail asynchronously with java mailAPI: new Thread in IExecutionListener.onExecutionFinish not working

Not able to take response body data for assertions while performing operations using rest-assured with java

Getting TestNG error after import Maven project

How to run single @Test method in parallel using 1 dataprovider defined in same Testng class

Shared same dataprovider with mutilple testng test cases, giving Null Pointer exception while reading the data from excel for second test case

Screenshot is not getting displayed in TestNGResults under Jenkin

Maven test failing: Cannot find symbol

Inherited properties read by Spring @Value are null

Parallel tests with resource-lock?

classpath not found. fork not processed for testng

I want to login to different browsers using different username and password

TestNG XML created programmatically not executing testcases

Gradle + TestNG parallel execution issue

Access allure reports while test is running

"Executing a test in testNG based on condition"

Not able to execute testng.xml file from gradle command line

Allure @Step does not appear in the allure report (Selenide TestNG Gradle Allure)

Tests that need to extend both AbstractTestNGSpringContextTests and GalenTestNgTestBase

ITestResult doesn't return parameters from XML suite

unable to get the default selected value of drop down from selenium

Writing a data provider class taking Hashmap as collection and passing it for multiple parameters in API Test

webSocket not causing testNG to fail (JAVA)

Extent Reports: Test Steps are getting merged in last test in Extent Reports, When executing test in Parallel

ExtentReport code showing error when import aventstack files

Return Data provider type Object[] from a Hashmap of <String, List<String>>

How to use screeshotcapture in IReporter interface in Selenium using TestNG?

Getting all values as zero when running automated tests but not when run tests manually

Capture log messages in unit tests using TestNG (Log4j2)

Unable to run xml test suite from command prompt

Needs to mock beans in integration test case

TestNG: retried test with DataProvider fails with error "argument type mismatch"

How can I unit test my log messages using testng

zalenium java null pointer exception

I need to set the code below to run in parallel. I'm using TestNG, Java and Selenium Web Driver

Want to develop Java logic which dynamically checks child web elements present in parent web element

Verify Mock calls in a particular test

org.testng.TestNGException: sun.security.provider.certpath.SunCertPathBuilderException: unable to find valid certification path to requested target

Update the Suite Name at RunTime

Selenium - Maven/TestNG: How to add "testng.xml" and log4j2.xml path in pom.xml so executable .jar file can be executed on other machine as well?

Selenium - Maven/TestNG: how can we add testng parameters in Java class while adding "main method" to create executable /runnable.jar file?

unable to generate unique extent report i have used SimpleDateFormat Class

Control does not switch while new window pops up

@DataProvider is not detected as an annotation type

Extent report not marking my tests FAIL, if test failed due to NoSuchElementException or any other exception

Allure Report In Cucumber TestNg Parallel show as one scenario in the report than two

I configured the tests in parallel, but it is not working (I am using TestNG - Please help me)

getEnclosingMethod returns NullPointerException

While adding extentreport class getting an SSL certificate error

how to get ITestResult from IsuiteResult

How to change the css of testng reports?

How to generate extent report for cucumber + testng framework

Unable to run TestNG due to java.lang.NoClassDefFoundError: org/testng/CommandLineArgs

How do I generate a test extent reports for gmail login?

REST api testing and accessing a repository bean or a service bean

clear method not working with testng but working without it

org.apache.maven.surefire.booter.SurefireBooterForkException: There was an error in the forked process null

TestNG doesn't show line number for line from where the null pointer exception occurs

How to run two test methods in two different browser in parallel using TestNG?

How to stop TestNG from running after a test fail

No plugin descriptor found at META-INF/maven/plugin.xml