sinon trying to spy express res object

How to mock express in nodejs when express app is located inside function?

JavaScript test (mocha) code organization

firebase functions: Unit test for storage onFinalize()

Laravel Unit Test (The response is not a view)

Unit Testing in XCode (Obj C) With MVVM

Error: Cannot find module '@angular-cli/plugins/karma'

HttpErrorResponse: Http failure response for api url jasmine test

Spy function inside jquery anonymous function

Angular Test failed Can't bind to 'header' since it isn't a known property of 'app-previewer'

Test import modules with unittest?

How to write test for state of screen when set data. Activity has in recyclerView and load data from apis

CUnit CU_register_suites(suites) error

How to test multiple apps on a single unittest Framework

How to Unit test ListProductHandler class using Kotlin ShouldSpec()

Mocking a faulted Execute Multiple Response

How to add a custom test runner to a Jetbrains IDE

System.Collections.Generic.KeyNotFoundException: The given key was not present in the dictionary: DYNAMICS 365 Plugin

How to mock matplotlib in python (to prevent showing plots)

Jasmine unit testing angular component that subscribes to a service subject in the constructor gives cannot read property subscribe of undefined

How do I mock a function from another package without using dependency injection?

AndroidStudio doing AndroidInstrument 'unit' tests: java.net.BindException: Address already in use: connect

How to Unit Test a Ruby on Rails Application

How to mock a class that has parameters in the constructor using Mock.Of<> syntax?

Previously Working VSTS Build Times out When Executing Unit Tests step

Using custom types for parameterized MSTests

Using verify on Spy object

How to stub post api calls from React Components using sinon?

Sinon Spy is not working when object is initialized with 'new' constructor

PHPunit: Can I mock class that I test?

Unit testing component with PrimeNG's schedule

Unit testing JavaScript contained in IIFE which has no export

Django: generate queryset with duplicates

Assert model was not made searchable

Karma Input parameter unit testing

Unit testing NestJS controller with request

Avoid passing mock objects to controller ctor (Unit Tests)

How to mock methods for writing unit tests in nodejs

How not to call (spy) methods of static member (KafkaTemplate UT)

Mocking Entity Framework IQueryable's where properties are navigation properties with InverseProperty

Live Unit Testing does not find Tests with NUnit3, while in Test Explorer are the tests shown

iOS - OHHTTPStubs doesn't stub Siesta calls

Dependency injection for testing a class

How to execute unit test in VSIX debug mode?

Jest mocking with react calling actual event handler after calling mock function

Python test - Assert statement for calling patched object

Why Is My Erlang Test Suite No Longer Able to Call External Functions

Chefspec unit-testing

How to Mock IMongoCollection.Find using Moq

Mock php functions

NgOnInit not subscribing to observable in mockActivatedRoute in Jasmine tests

How to get the currentUser provided by spring security in Grails 2 unit testing

How to access global functions in a SFC for a vue test

How to implement unit test program using golang?

ExceptionInInitializerError at org.mockito when using @PrepareForTest

How do I use Reactor's StepVerifier to verify a Mono is empty?

C# WPF: How to run wpf application triggered through code and send events like button clicks and combo box selections?

Jasmine test cannot find imported variable

Even after using @testable import moduleName project files are not available to Test Cases (iOS - Swift)

Custom validator not working running tests

How to read Android resource file values in unit testing

Load/Stress Test with Unit Test Paradigm

GoogleMock mocking non-virtual functions

Unit Test: Define result as an object

sinon spy on function not working

Eclipse cannot run JUnit 5 test cases in JUnit suite?

How are testing schemas used via PgTAP?

Python Unit Test Not Running in Terminal

MassTransit Consumer Test Passing But Confusing Error Thrown

Error: Error: the "filename" option is required to use includes and extends with "relative" paths

How to use FakeItEasy to verify FindOneAndUpdateAsync method ran Against faked MongoCollection?

How to use Microsoft.Extensions.Configuration.IConiguration in my XUnit unit testing

Mocha testing: _mocha: error: Unrecognized arguments

Mocha cannot read property of undefined for some keys not others

C++ Google mock/unit tests : Mock method not called and original one is

NSubstitute: Mocking properties

Sinon.js stubbing a class dependency using Proxyquire

Unittest class attribute error

Software testing, documentation

How to write mock test case for the controller inn java

ERROR with java.lang.Exception: Test class should have exactly one public constructor

Build definition in VSTS failes when running Coded UI Testing project

Exception during unit testing xml deserialization

How do i write a unit test for testing gui c++

Should we unit test predicate methods

Test failed with error in fastlane

`tkinter.iconbitmap` method returns empty string

Symfony Unit Test mock 2 repositories

Python - object MagicMock can't be used in 'await' expression

Can we test ngrx flow by using Jasmine/Karma in Angular?

python pytest occasionally fails with OSError: reading from stdin while output is captured

mock.js how to return with status is 404 or 502?

Load file during Unit Test in Unity3d's Unity Test Runner

spyOn isDevMode() in Angular 6+ Unit Tests?

Unit Testing a SAPUI5 controller with QUnit

How to Mock A Method(non-virtual) To Return Particular Value Using GMock in C++?

Unit Testing - how to properly calculate expected value for assertion

Sporadic behavior No argument value was captured! ArgumentCaptor for Static NewRelic using PowerMockito SpringBoot

how to alternate one test with test suite in pytest?

MQTT Client testing with junit