How to test a component with @Input and type Observable

How to clear a module mock between tests in same test suite in Jest?

How to run all tests in a nested directory in Android Studio. Error: 0 tests classes found in package

Trouble mocking method in a concrete class

Where is the DLL with test to run with the nunit3 console generated?

sinon stubbed class not found

Stubbing an action passed as a prop for unit test using jest in ReactJS

How rewrite gocov command to go tool cover?

How to unit test using a shim and a static factory method?

Mockito verify constructor calls method

SynchronizationContext + ParallelForEach deadlocks in unit test

How to run OneTimeSetUp and OneTimeTearDown from external class

Junit Testing a Delete Function Spring

Is it possible to add a key without a value in hashtable Java?

PHPUnit showing passed methods that throws Fatal Error Exception

JUnit How to Mock with varying values of parameter object?

How to unit test smart constructor that throw when construction is impossible?

How can I perform unit test on my ES service?

i want to test a method in a repository with events phpunit laravel

What use is @TestInstance annotation in JUnit5?

Simulating a Timeout in RSpec?

Jest test fail "Window is not defined"

How can I unit test the method having else condition?

Unit Tests on client PC

Karma Configuration in IntelliJ

Go unit test not finding required file

Mocked method is being called instead of mocked

i cant write anything about that, any line

Type 'TestClassAttribute' exists in both 'Microsoft.VisualStudio.QualityTools.UnitTestFramework and 'Microsoft.VisualStudio.TestPlatform.TestFramework

How do I reference a resource file to load for Visual Studio Live Unit Testing

Spy on a method passed into a mocked node module

How to mock RedisClient correctly? Exception: Unable to cast object of type 'Castle.Proxies.ObjectProxy_1' to type 'ServiceStack.Redis.RedisClient'

java.lang.IncompatibleClassChangeError org.junit.jupiter.params.provider.Arguments must be InterfaceMethodref constant

How to unit test a method calling a function that has a side-effect by changing an argument passed by reference?

Test not passing array parameters through

org.dbunit.dataset.NoSuchTableException: users

Is this structure recommended for test files in java?

Is it possible to test if element is visible when set by CSS classes using Jasmine in Angular 2+?

How to exclude mock files from Code Coverage Istanbul Reporter

Moq Verify or VerifyAll

Amazon DynamoDb create table

Do I need Mocha if looks like pure JS is enough for me?

Mock an axios request to external service in test

UnitTestIsolationException : Failed to resolve profiler path from COR_PROFILER_PATH and COR_PROFILER environment variables

Creating a generic UI in React that wraps UI library

Cannot mock the class using mockito in spring weflux

how to test export file in laravel

Unresolved externals when trying to add unit tests to global heavy code

Getting "retryCount" from ServiceRuntime: FAIL for unit test

Jest/Mocha + TypeScript: Jest/Mocha tries to read JS dependencies and fails - "unexpected token import"

any use of Assertions.fail() in JUnit5?

CMake: target "test" doesn't build tests, target "all" does

eslint rule forces exponentiation operator vs Math.pow causing ALL Jest test suites to fail with SyntaxError: Unexpected token *

.NET Unit Testing on Service that requires it run in it's own context

How to configure jest to be able to use es2015 in webstorm?

Simulating a request for flask unit tests

JavaScript Jasmine Framework how to write a Test to Fail case

How can I decouple system design from unit tests (as suggested by Uncle Bob)?

Moq Verify Times.Once not working with It.Is specific parameter

Uncaught Error: Uncaught (in promise): Error: Cannot match any routes

PHPUnit only recognizes three of my four tests

SinonJS stub getter defined with configurable false

Mock method return based on object parameter

Go passing the test case while giving 500 as the response

Fail Test Case if exception is raised and handled in Python

how to spy on observable variable

In mocha unit test, how to mock a global variable?

Fail tests by default (Intellij IDEA)

Data generator for a given flow type

nodejs unit testing: spyon never called

How to write unit testing for function below with a doubly linked list?

OPENSSL_Uplink(xxxx,xx): no OPENSSL_Applink for Unit Testing in C++

iOS Test Suite crashes after running xctest.xctwaiter

PyTest Allert / Message Box

Create with Ruby tests for a class

httpinterceptor test failing

Unittest failed when selecting Run All

Unit testing with Jest without module.exports

Unit testing of exported function using react / enzyme

Angular 6 - Unit Testing Mat-Select

How to provide routes with guards for unit testing Angular 6 Component?

FuelException: Can not connect to the Redis engine

Error: connect ECONNREFUSED 127.0.0.1:3100

Mock method which is called inside another method

How to do unit testing for nested "using" statements in C#?

Sinon - spy not being called but test enters into the function

Unit tests failing in Visual Studio 2017

If SonarQube gets fed coverage results from JaCoCo (e.g.), how it is using its metrics?

Update Server Group Unit Test Cases Python

TypeError: Cannot read property 'args' of null, unit tests, jest

Python: Unit test case shows no error if login does not work

Unit tests for a project with multiple targets

Call another click command after first one

How to provide Injected constant to service in nestjs when unit testing

Mockito keeps returning Empty List

Asserting entire json response without hardcoding the data using RestAssured and TestNG

Issues invoking Powershell asynchronously via Unit Test

Junit with Gui action methods

How to test a unhandledRejection / uncaughtException handler with jest

Testing internal classes in swift framework