Rspec which actually tests method with instance variable

Django app + Amazon S3 generates RequestTimeTooSkewed when unit testing

Can't run tests after shortened command line

Is there an equivalent of verifyZeroInteractions() for verifying an exact number of interaction with a mock object?

jest unit test - Cannot find module config from 'xx.tsx'

How to unit test djano-rest-framework api with data along with imagefield

Non Instrumentation Tests for Room Database

Mocha Unit Test

How to mock the bound context of a celery task

How to test timeout() in a rxjs pipe with jasmine-marbles

Controller method doesnt return moq data

Is there any good reason to catch exceptions in unittest transactions?

Using Two Different Mocks in Go Unit Test

Ignoring user input when testing with unity

Unit testing .NET application

and.callthrough returns empty array

ABAP Unit tests are only detected / executable right after generating. How to make the test class visible?

Assert that code gets ran at some point in unit test?

Python Unittests - Twisted Trial change path of _trial_temp

How to unit test SKStoreReviewController in Swift

Unit test failed for privacy mode

Why test assemblies are not filtering in VSTS azure build pipeline despite putting test assembly patterns?

How to get karma/jasmine unit tests working with a callback after a promise?

How to mock an async action creator in redux with jest

How can I mock a component with Jest?

Properly testing for a function that logs an error message and raises SystemExit if condition not met

How do I unit test a method that calls Process.Start and takes in the .exe path

Set a variable to null after a service call in karma jasmine

Race detection in table driven test

Calling managed C++/CLI from native C++

How to create mockito test for Manual dependency injection

Python mock vs unittest.mock patch

How to make a set up for unit testing with the bot framework (Echobot, using ITurnContext)

How to stub/mock a method's/constructor's parameter in jest for unit testing in nodejs?

AngularJS unit testing Karma - unknown provider

Unit-testing - TypeError: 'dict' object is not callable

method for unit test

Trying to convert this Mockito test to Mockk results in error

Compare UIColor in ObjectiveC Unit Test

Mock Third party library (Razorpay) in Angular Unit tests?

unit testing a post service with karma jasmine angular 7

Build error for DB unit test project in VS2019

Karma conf: Uncaught SyntaxError in Chrome Headless

How to unit test CRUD (Retrieve)?

ExtJS Unittesting Pakages Independently

How to write unit test for below function

How to test Go code with filepaths defined as constants

How to implement junit coverage with jacoco in ant build?

ScalaPlay > 2.6 how to access POST requests while faking a trivial server in tests

Golang: how to generate a net/http timeout Error to perform unit test

Error running unit tests on Android Studio - Command line is too long

Jest: setTimeout is being called too many times

console.log unit test failing under mocha with unknown error

jdbcTemplate Mockito unit testing

kotlin - Room database error when unit testing

Mock an IList.Add using Moq

How to test Rest API endpoint which takes value from constantly changing external API

I would like to know how to make a unit test for api call using kointest

Selenium - System.ArgumentNullException: text cannot be null Parameter name: text

How can we measure the performance of azure search suggest API for 100 concurrent users?

I can't set ActivatedRoute in unit testing

Mock-heavy testing

Angular Service Member Variable Not Accessible in Unit Tests

Mock class prototype in javascript with jest

verification for unit tests failed

Define Unit test run

karma configuration to disable headless chrome and use only terminal

setData of vue-test-utils not re-updating the component

How to unit test a method that changes reference of a private field

how to unit test router.navigate in angular app

Running just the tests of the changed components/services in VSCode

Mock call to static method of a utility class

Testing practice an API wrapper without using unittest module

How to mock a python function inside another function

react-testing-library | Cannot Split Test into smaller chunks inside describe method

Why are my tests passing with conflicting assertions?

Why am I getting an AssertionError durin unittesting?

Including an interface header from a cc_library target to a cc_test target

Swift unit testing: module name of object class causes type check to fail

NotAMockException when calling static mock in Scala

Why PowerMock runs private method when I call verifyPrivate?

How Can I Test My Component's Methods When Using Connect() and PrefetchResourceContainer

How to mock a keypress in test method?

Verify mocked method call with lambda?

Xcode Code Coverage. What's the difference of red color and striped red?

In Unit Tests how can I programmatically dismiss system permission dialog?

Spring cloud contract: IllegalStateException: You haven't configured a MockMVC instance. You can do this statically

How to traverse through multiple elements and check each elements text is as expected or not

Angular 2, pipe test with observable has no transform access

Mockito's when() isn't stubbing superclass's method

Golang test for API fails but gets correct results

org.springframework.web.util.NestedServletException || org/springframework/core/log/LogFormatUtils

Golang test of REST API dumps entire database

NSubstitute Received() fails when it shouldn't for static arrays

What kind of tests should I write in my case?

How mock method that called in testing method for Android?

Angular unit testing prime ng calendar

How to mock AppDomain.CurrentDomain.BaseDirectory

Adding screenshot along with unit test

how to get current test method name in any class of project in codedUI?