I was unable to run the iOS(React Native) app after updating XCode 12.5

Log :-

INFO : BSG_KSCrash.m (286): -[BSG_KSCrash sendAllReportsWithCompletion:]: Sending 2 crash reports

2021-06-10 16:10:58.484602+0530 App[59224:548597] [connection] nw_proxy_resolver_create_parsed_array [C23 proxy pac] Evaluation error: NSURLErrorDomain: -1003

2021-06-10 16:10:59.401755+0530 my app[59224:548593] [connection] nw_socket_handle_socket_event [C24.1:1] Socket SO_ERROR [61: Connection refused] 2021-06-10 16:10:59.405516+0530 my app[59224:548593] [connection] nw_socket_handle_socket_event [C24.2:1] Socket SO_ERROR [61: Connection refused] 2021-06-10 16:10:59.407989+0530 my app[59224:548597] [connection] nw_connection_get_connected_socket [C24] Client called nw_connection_get_connected_socket on unconnected nw_connection

2021-06-10 16:10:59.475431+0530 my app[59224:548597] [connection] nw_socket_handle_socket_event [C25.1:1] Socket SO_ERROR [61: Connection refused] 2021-06-10 16:10:59.479723+0530 my app[59224:548597] [connection] nw_socket_handle_socket_event [C25.2:1] Socket SO_ERROR [61: Connection refused] 2021-06-10 16:10:59.482687+0530 my app[59224:548012] [connection] nw_connection_get_connected_socket [C25] Client called nw_connection_get_connected_socket on unconnected nw_connection 2021-06-10 16:10:59.483563+0530 my app[59224:548012] TCP Conn 0x6000036d04d0 Failed : error 0:61 [61] 2021-06-10 16:10:59.775719+0530 my app[59224:548597] Reports sent. 2021-06-10 16:10:59.801 [warn][tid:com.facebook.react.JavaScript] Require cycle: App/Utility/Utility.js -> App/Services/ManageToken.js -> App/Utility/Utility.js

Require cycles are allowed, but can result in uninitialized values. Consider refactoring to remove the need for a cycle. 2021-06-10 16:10:59.863 [warn][tid:com.facebook.react.JavaScript] Require cycle: node_modules/@babel/types/lib/definitions/index.js -> node_modules/@babel/types/lib/definitions/core.js -> node_modules/@babel/types/lib/validators/is.js -> node_modules/@babel/types/lib/validators/isType.js -> node_modules/@babel/types/lib/definitions/index.js

Require cycles are allowed, but can result in uninitialized values. Consider refactoring to remove the need for a cycle. 2021-06-10 16:10:59.865 [warn][tid:com.facebook.react.JavaScript] Require cycle: node_modules/@babel/types/lib/definitions/index.js -> node_modules/@babel/types/lib/definitions/core.js -> node_modules/@babel/types/lib/validators/is.js -> node_modules/@babel/types/lib/validators/isPlaceholderType.js -> node_modules/@babel/types/lib/definitions/index.js

Require cycles are allowed, but can result in uninitialized values. Consider refactoring to remove the need for a cycle. 2021-06-10 16:10:59.866 [warn][tid:com.facebook.react.JavaScript] Require cycle: node_modules/@babel/types/lib/definitions/index.js -> node_modules/@babel/types/lib/definitions/core.js -> node_modules/@babel/types/lib/validators/is.js -> node_modules/@babel/types/lib/definitions/index.js

Require cycles are allowed, but can result in uninitialized values. Consider refactoring to remove the need for a cycle. 2021-06-10 16:10:59.870 [warn][tid:com.facebook.react.JavaScript] Require cycle: node_modules/@babel/types/lib/definitions/index.js -> node_modules/@babel/types/lib/definitions/core.js -> node_modules/@babel/types/lib/definitions/utils.js -> node_modules/@babel/types/lib/validators/validate.js -> node_modules/@babel/types/lib/definitions/index.js

Require cycles are allowed, but can result in uninitialized values. Consider refactoring to remove the need for a cycle.

2021-06-10 16:11:00.174 [info][tid:com.facebook.react.JavaScript] 'BASE_URL', 'https://dev.fisdbs.com/dbs/' INFO : BSG_KSCrashReport.c (1513): void bsg_kscrashreport_writeStandardReport(BSG_KSCrash_Context *const, const char *const): Writing crash report to /Users/e5599459/Library/Developer/CoreSimulator/Devices/9C8DC585-7A54-4448-A919-A7FD114E763E/data/Containers/Data/Application/53C7609D-3B57-4A64-B613-F8854DDAA8AC/Library/Caches/KSCrashReports/my app/my app-CrashReport-D506C784-6401-4FD0-98D8-4C67DCD0F542.json 2021-06-10 16:11:00.956 [info][tid:main][RCTRootView.m:293] Running application fcbMobileBanking ({ initialProps = { }; rootTag = 21; }) INFO : BSG_KSCrashReport.c (1513): void bsg_kscrashreport_writeStandardReport(BSG_KSCrash_Context *const, const char *const): Writing crash report to /Users/e5599459/Library/Developer/CoreSimulator/Devices/9C8DC585-7A54-4448-A919-A7FD114E763E/data/Containers/Data/Application/53C7609D-3B57-4A64-B613-F8854DDAA8AC/Library/Caches/KSCrashReports/my app/my app-CrashReport-4B3F6D90-E9B3-489A-9255-6A1AD52FE3B5.json 2021-06-10 16:11:01.617 [error][tid:com.facebook.react.JavaScript] Invariant Violation: Native module cannot be null.

2021-06-10 16:11:01.623 [fatal][tid:com.facebook.react.ExceptionsManagerQueue] Unhandled JS Exception: Invariant Violation: Native module cannot be null. 2021-06-10 16:11:01.670472+0530 my app[59224:548594] [connection] nw_proxy_resolver_create_parsed_array [C27 proxy pac] Evaluation error: NSURLErrorDomain: -1003 2021-06-10 16:11:01.795 [error][tid:com.facebook.react.JavaScript] Invariant Violation: Module AppRegistry is not a registered callable module (calling runApplication) 2021-06-10 16:11:01.798

[fatal][tid:com.facebook.react.ExceptionsManagerQueue] Unhandled JS Exception: Invariant Violation: Module AppRegistry is not a registered callable module (calling runApplication) INFO : BSG_KSCrash.m (286): -[BSG_KSCrash sendAllReportsWithCompletion:]: Sending 2 crash reports 2021-06-10 16:11:06.181814+0530 my app[59224:548012] Reports sent.

2021-06-10 16:13:59.170853+0530 my app[59224:551497] Received XPC error Connection interrupted for message type 3 kCFNetworkAgentXPCMessageTypePACQuery 2021-06-10 16:13:59.171189+0530

my app[59224:551497] Received XPC error Connection invalid for message type 3 kCFNetworkAgentXPCMessageTypePACQuery