Do I need to type every time : sudo gem install cocoapods

Why if I run npm install using react-native "0.63.2" build the libraries with extension podspec

Fresh init React Native Build has CompileSwiftSources normal x86_64 error on Xcode 12

Undefined symbols for architecture arm64, it seems just randomly happened to some third party framework using cocoapods

iOS BUILD FAILED - Google Maps and Google Places pod conflicts

How to link missing pod headers - Xcode 11.2.1

Error installing Realm in Terminal through cocoapods

How do I add a pod post install script to a flutter application?

Adding CocoaPods to watchOS Targets

Installing Cocoa Pod dependency without one of it's sub dependency

Pod Install: Unable to find source ref for target

SSL verification error when installing cocoapods

None of your spec sources contain a spec satisfying the dependencies: Firebase (~> 6.33.0), Firebase (= 6.33.0, ~> 6.33.0)

error: module was created for incompatible target arm64-apple-ios8.0

Got error when installation cocoapod in acOS CATALINA

Customising Firebase Crashlytics crash reports

How can I change pod binary used by pod install

How to undo accidental pod trunk push

pod spec lint error - [iOS] xcodebuild: error: Unexpected duplicate tasks:

Import a local pod with grpc swift into application

react-native image is not loaded in iOS 14 upgrade

Cocoapods: Unable to add a source with url named trunk

Swift, cocoapods

Xcode 12 cocoapods indirect framework dependency missing?

Firebase iOS - Undefined symbol: _GULResetLogger (arm64)

Cocoapods - Error installing Mapbox-iOS-SDK

React-Native cannot manually link libraries on XCode

Build input file cannot be found

FBSDKCoreKit.modulemap not found in XCode with Cocoapods

React-native iOS : Cocoapods could not find compatible version for pod "Firebase/CoreOnly","Google-Maps-iOS-Utils" & "GoogleMaps"

clang: error: linker command failed with exit code 1 After XCode 12 update

Remove Firebase dependencies on iOS in React Native 0.61

What are common causes of classes not importing correctly in XCode, but only for the simulator and not generic build?

iOS app build fail on App Center: Error: /usr/bin/xcodebuild failed with return code: 65

source_files in podspec when source code is organized into nested group folders

How to do custom activityController in swift?

Xcode12 file not found

Do I have to upload xcworkspace files to GitHub?

Cocoapods static pod podspec.json add simulator

Xcode 12: Compiling for iOS 10.0, but module 'RxSwift' has a minimum deployment target of iOS 12.0

Flutter locked on old pods

Issue when installing cocoapods

Cocoapod Library: Module compiled with Swift 5.2.4 cannot be imported by the Swift 5.3 compiler

Module compiled with Swift 5.2.4 cannot be imported by the Swift 5.3 compiler

ld: library not found for -lreact-native-background-timer

GoogleDataTransport is throwing Double-quoted include in framework header expected angle-bracketed error on iOS14

React-native iOS not showing images (pods issue)

Unable to install AudioKit 4.11 via CocoaPods in xCode 12

Xcode 12 update breaks Pods and Products

CocoaPods pod install is removing some build phases

Xcode 12 HaishinKit lib build error: Undefined symbols for architecture x86_64

Swift Xcode - FittedSheets Errors

Error "Double-quoted include "pb.h" in framework header, expected angle-bracketed instead"

Are CocoaPods in the specs repo the only official releases?

MatrixChat and MatrixSDK Non-Modular includes in SDK's via CocoaPods

no such module 'OpenCV2' in Xcode after successfully installed OpenCV2 cocoapod

Exception: CocoaPods not installed or not in valid state

ModuleName-Swift.h always #import <ModuleName/ModuleName.h>

MTBBarcodeScanner error at flutter run with qr_code_scanner

Updating firebase/core pod causes error when building the xcode project

iOS DropDown CocoaPod

"React/RCTLog.h file not found" and "Bad receiver type 'int'": Misplaced CocoaPods files to blame?

Best Optical Character Recognition (OCR) CocoaPods for iOS

Android Studio doesn't recognize cocoapods

Why won't unit tests build when the test target is excluded from CocoaPods management?

My Cocoapods framework methods are not available by import in another app

How do you resolve a library not found error for realmcoreiOS

Cocoapods - framework not found FirebaseCoreDiagnostics

React Native pod install fails [BMSCore]

How a LocalPod can add dependency of a same name

unable to use zsh/bash in Jenkins Execute Shell

dyld: Symbol not found: _OBJC_CLASS_$_Reachability, Xcode 11 crash

React Native pod install fails [nanopb]

Getting 'AE/AE.h' file not found, help linking .h files

Invalid bitcode version for archiving iOS app

CocoaPods: Failed to build gem native extension

How to manage iOS lib project which is different from many callers´╝č

Use an iOS framework that has dependency on some pods

Error on Reloading Changes in iOS development Pod for react Native

XCODE ERROR: Showing Recent Issues /Users/Derek/Desktop/Xcode Projects/Jumper/Pods/BoringSSL-GRPC/src/ssl/internal.h: No such file or directory

XCode project build fail: x duplicate symbols for architecure x86_64 clang: error: linker command failed with exit code 1 (use -v to see invocation)

Use of undeclared identifier 'FIRApp'

Cocoapods:[!] CocoaPods could not find compatible versions for pod "Firebase/Storage":

Obj-C to Swift conversion (inc. Cocoapods)

Getting .h file not found after adding after 3rd party framework inside React-Native-Video package

React Native. ERROR: linker command failed

I am getting error in pod install using react native

Pod file keeps disappearing after some time

Getting erro while running flutter project "Error running pod install"

mobile-ffmpeg-https (4.3.1) POD install failed

Not able to build for iOS in flutter

Flutter build for ios failed repeatedly

Adhara Socket doesn't work on iOS Flutter

Cocoapods: Add react native dependency in Podspec

"Pod install" gets rid of all run build phases scripts

Automatically assigning platform `iOS` with version `8.0` on target `Runner` because no platform was specified

DJIwidget framework won't compile on Xcode with error: Command Ld failed with a nonzero exit code

How to install a cocoapod that contains a cocoapod?

How to install private pods with GitHub Actions?

How to install a swift framework which has a cocoapod dependency into your swift app project in Xcode?