Why does "Exception in thread" occur?

CL Unknown Errors

cmake invalid numeric arguments

arm-none-eabi-gcc missing openssl

Arrow in case statement supported from Java 14 onwards only Java compilation error

Function return type mismatch between header and corresponding source file in C++

VBA ByRef argument type mismatch passing varaint array between subs

C++ on Mac, trying to link with unknown-unsupported format. makefile fail

"'nullptr' was not declared in this scope" in GCC 7.5

There's an error stating that I'm missing a "type specifier" and that I can't assume an "int". The code is for a synth, and is in VS 2019 Community

Fatal error: Array and string offset access syntax with curly braces is no longer supported

C++ error Please help me out I don't know how to fix this

Why am I getting a syntax error with this recursive method?

Error: variables 'n' and 'x' used in loop condition not modified in loop body

how should I can fix this error: no match for 'operator<<' (operand types are 'std::basic_ostream<char>' and '<unresolved overloaded function type>')|

how to create a opencv python application in raspberry pi

ArduinoJson <overloaded function with no contextual type information>

collect2: error: ld returned 1 exit status, undefined reference

Why do I get TypeError: unsupported operand type(s) for /: 'int' and 'builtin_function_or_method'

Unusual compiler errors when using <windows.h>

C++ Compiler options for huge legacy code

Lex-Flex(compiler) programme does not give the output

C++ Vectors Template argument 1 and 2 is invalid

Compiler can't find DPI related functions

Logical AND error in java. Not able to do binary AND

Creating a base case for Variadic Template recursion with no template arguments

Cannot run my oracle procedure on node js

How to use Polly analisys tool on a LLVM pass?

Why doesn't my example satisfy this "requires" expression?

Error while starting class Process: com.example.game, PID: 22750

Win32 Not Compiling For Me

Undeclared identifier error while using "requires" with variadic template

C++ - function multiple definition of `Lexer::Tokenize

warning: '<symbol>' may be used uninitialized in this function [-Wmaybe-uninitialized]

Why does my compiled code not run in C++?

g++: error: code.cpp: No such file or directory

How to determine which annotation processors are being used?

lossy conversion between ā€œS.charAt(index) + '0' ā€œ yields compile-time constant expression error

Why is NVCC more strict with constexpr than non-constexpr host functions?

Why do I have still an undefined reference?

My dart code does not compile because of some onknown error in line 4

The following error occurred while executing this line: 1251

error: implicit declaration of function 'rl_replace_line' is invalid in C99 [-Werror,-Wimplicit-function-declaration]

C++ Dependencies directories between files

why I receive 0x6400? Javacard CAP File using GP

Visual Studio build giving error on a different file than the current file

Maven compiler plugin Unsupported class file major version 60

How to access the error object when the Promise of a createAsyncThunk dispatch is rejected?

R markdown themes not knitting

error: expected identifier before 'public'

error: InterstitialAd is abstract; cannot be instantiated final InterstitialAd mInterstitial = new InterstitialAd(AddDevicesToTransferActivity.this);

error: invalid types 'int[long int]' for array subscript, error: 'vector' does not name a type, error: 'engine' has not been declared, etc

getting free(): invalid size when executing code

TypeError: 'int' object is not callable, assigning equal names to diff variables?

Unexpected token error in concatenation in C language

Including <linux/ptrace.h> and <sys/ptrace.h> is an Error?

OCaml This variant expression is expected to have type unit

Error is appear when I try to install matplotlib library

Why do I get compilation error when trying to use record type in C#?

Operator '+' cannot be applied to operands of type 'DateTime' and 'int' for add days

Vs code is not running python program

How to output all Python syntax errors in the same file?

Python Error: sh: COMMAND: Command not found

hello there ,nowads i am working with react and came accross one error and i dont know how to fix it

How to fix Gatsby Develop building-schema error?

compatibility of Parameter initialization in Fortran

undefined symbols in object file

processing sketch is not compiling correctly

C, storage size isn't known?

Xamarin Android error XA0136 deployment errors

I am making a voice assistant and I am facing an error can someone help me solve that error?

C++ git repo compile trouble

overloaded << operator function : unresolved external symbol error

zgetrf routine is very slow with gfortran 9.3

"error adding symbols: File format not recognized" error while trying to compile cython c code

collect2: error: ld returned 1 exit status" on R to install statmod package

It say UnboundLocalError, How can i update variable after assigning it in this code?

The this pointer in c++

Linux Debian 10 how to use c++ 20

Error: cannot convert argument 1 from 'Packaged_Task::<class_name>' to 'std::nullptr_t'

Error 42 error C2664: : cannot convert parameter from 'classname*' to 'const classname*&' in file algorithm

How do I update a compiler?

C, C++, and Java compilers all show the error "The filename, directory name, or volume label syntax is incorrect."

Why do I get an error in this JACK (nand2tetris) fie

Could not open .xcodeproj file in Xcode Display .pbxprojfile is empty

Intel fortran compiler treats integer array as substring

Using 2 peices of Java source code I get the error: Cannot find symbol when trying to compile

makefile error: No rule to make target How to fix?

How to tag a "TS2531: Object is possibly 'null'" when the object is never null" error as a false positive?

Hi, I have an attribuate problem in my python code

How to improve my makefile in C to move object files and compile even if there are errors?

Compilation error for kernel header file printk.h

"err declared but not used" with multiple errors

build failed with first substrate chain

using "SetupDiGetClassDescription" on qt 5.9 msvc 2015

Getting error "library not found ldoubleconversion" in XCode 12.5 for ReactNative project

When using custom class in std::map with custom comparator -> error: static assertion failed

I have an error in Xcode please help! 1 duplicate symbol for architecture arm64

The generic type already contains a definition

i am trying to install one vuejs template but having this issue while running serve command