Create test in pytest without hardcoding path of external dependency

Is it possible to mark doctests in pytest?

Running python -m pytest tests fails to locate packages

Running an asyncio server from a pytest fixture

How to set dynamic marks parameter in pytest.param when using pytest_generate_tests()

Patching a method of a class that is already patched

Issues between include and source with coverage.py

How to create multiple tests for a function using sys.arv in pytest

Excessive memory usage of pytest & pyspark

Multilingual test using selenium pytest

How to test a function which must infinitely loop in some cases?

Pytest session fixtures not executed anymore

Why am I getting timeout error in Django Channels?

Pytest: Date Object cannot be passed on as parameter to a fixture

With pytest, how to correctly mock a function of an external module?

pytest django load database data from yaml file

Fetch command line argument and assign it to global variable using pytest

Print test output during tests in PyCharm

Testing an electron application through pytest-selenium

Problem using pytest.main() with creation of html report

How to test the exception of try/except block using pytest

How to best mock module-level function reference in python

Testing the code of a Pub/Sub function with Pytest

When to assume dash m usage and avoid __init__?

running pytest via docker-compose

pytest-selenium installed but not available as plugin for pytest. What have I done wrong?

Armazenar texto copiado(CTRL+C) em uma variavel sikulix

pytest requests_mock not working with yield

Pytest-xdist throwing AssertionError when remote module has pytest_collection_modifyitems()

Got "ValueError: option names {'--alluredir'} already added"

FAILED test_main.py::test_login_success - tortoise.exceptions.ConfigurationError: No DB associated to model

Using Pytest to monkeypatch an initialized redis connection in a flask application

Global variables in python/ pytest Selenium Automation

Full Traceback with pytest-check?

Import package/script from outside package/folder

How can I pass scenario specific arguments to pytest bdd after_scenario hook?

How to read command line argument while running py.test -sv B/

Mocking Thread module in python

FAILED test_main.py::test_login_success - assert 405 == 200

Using locust with pytest

dynamically generate tests based on command line arguments

Is there a way to pass or fail a test automatically if another test passes or fails

Executing PyTest tests according to a certain order (dependency between parametrize)

Pytest: Passing on multiple parameters to a fixture

How to apply indirect parametrization to multiple fixtures used in a single test?

fixture 'pylon_config_missing_usageplan' not found while running pytest-bdd

How to show pytest output during run in PyCharm?

test results showing 0 tests run

Why do we need unit testing in Python when we have assert?

How to trigger a code segment when a certain function is called for testing in python

Is PyTest supposed to run all code or just the function being tested?

pytest unable to discover tests in VSCode

Unable to run the selenium pytest tests with webdriver-manager using the docker container with python:3.9-alpine image

How to use the output of a fixture as input to a function as parametrize pytest

How to solve PytestConfigWarning: Unknown config option: DJANGO_ SETTINGS_MODULE error?

Test fails when run in parallel in python selenium via pytest xdist but works well in sequence

Mocking model.User using mixer throughs error

relative import of modules in pytest in a Scafold structure

How to integrate MongoMock with Pymongo-Flask

pytest database access takes 66 seconds to start

Pytest-xdist not recognising custom pytest plugin that is executed as script

Pass variable(s) to dependent tests in pytest

ERROR: file not found when using pytest with VSCode (macOS)

Pytest and concurrent.futures interacting strangely

how to run specific test in VS code with python test explorer

How to combine Pytest-BDD with Playwright

Import Error while importing test module in VScode

Prevent multiple parametrization across tests with same pytest marker

Pytest doesn't seem to recognize and run my tests

Dealing with the No source for code error in Python coverage

What should I use to test Django application?

@parameterize in python unitests class methods

Invoke, pylint and codesytle

I am getting an error after importing pytest

pytest: assert no output from tests

How does importing a module from a parent directory work when using pytest?

Updating global variable pytest

Testing processed output against known output using pytest

Can we use assert in if statement?

How to test Django model using Django test and pytest?

error occurs when I do api testing with Pytest and Yaml

How to make pipeline stage grid be displayed as Unstable when the pytest job has failed tests

Unit test architecture with pytest

How to use a file in the project to compare a temporary file while testing with pytest in GitHub?

Filling in remaining kwargs with unittest.mock.ANY

Access CLI parameters with pytest and xdist

How i can make logs report(file and stdout) with logger then running pytest tests

Pytest-mock not patching imported function in class module

Pytest unit testing

how to change or check the order of the tests using pytest-asyncio

pytest fixtures as params not yielding

Using SQLAlchemy 1.4 classical / imperative mapping style?

Subprocesses Setup and teardown around pytest tests. OS Ubuntu

Test (Python) tkinter menu dialog?

Corner test case scenario in subtraction

Patch sqlalchemy now() function to run test as if it's 2 hours in the future

Mocking methods of custom MongoDB class

AttributeError: 'NoneType' object has no attribute 'get_screenshot_as_file'

How can I get data which I attach to allure report by allure.attach?

How to assert logging error which is followed by a sys.exit()