Java a Beginners guide Try this 4-1 gives java.lang.NoSuchMethodError

Trying to run a cpp program but I get the following error: [process exited with code 3221226356 (0xc0000374)]

python won't recognize Pandas

What is "fix" in Haskell? And why does "fix error" print an infinite string? And why also "take 10 $ fix error" does the same too?

Run time error 2107 after running a "DELETE .." SQL statement - VBA/MS Access

Whenever i try to implement Dark mode in my Settings, i get this crash (Android Studio, java)

FAILURE: Build Failed with an exception error when running app

getting error while unmarshalling yaml in golang

Object not found and not exist

createTempFile is giving The filename, directory name, or volume label syntax is incorrect Error

error while trying to run django application

ERROR: TypeError: Cannot read property '...' of undefined using .end() with fs.createwritestream()

Runtime error 1004 when putting borders around cells

Classification of programming errors

Python RuntimeError: run loop already started in pyttsx3

Digitalocean Apps platform run time error - "workspace" directory is getting added

Error starting neo4j community edition 3.5.32 service on Windows 10

Unity Trying to add image for graphic rebuild while we are already inside a graphic rebuild loop. This is not supported

MS Access VBA loop error, Run-Time Error 3071

JIT runtime error in SelectQueryBuilder.getResultList()

Calling COM object function has CLR call FailFast without specifying a reason

Error : E/cr_PlatformSer-Internal: UsageReporting query failed

Runtime Error 1004 "Can't find the Paste property for the Pictures Class"

Why is this error message being sent while using the flicking package?

VS2022 Xamarin Forms ios deployment blackscreen after launch

My programs doesn't return 0 when deleting array pointer

I wrote this vbs code and it executes successfully until the last line of code, then it shows the overflow error. Can somebody help me with it?

RuntimeError: output with shape x doesn't match the broadcast shape y

Exception: Context is null, please call ToastContext.init(context) first

Segmentation Fault while taking input as string and parsing it into a 2D array

How to avoid RuntimeError while call __dict__ on module?

Python Chat Bot Tutorial - Chatbot with Deep Learning

Flutter: Error when loading scaffold body from a row page seperate file

Facing issue while opening Android Studio

Macro not available or disabled

React Error: Child compilation failed: Must use import to load ES Module

Flutter Errors, Another exception was thrown: Invalid argument(s) AND Another exception was thrown: Incorrect use of ParentDataWidget

How i create a model with a sub model in flutter

Some controls not displayed at runtime in WinForms app

Get report name from DataSource of subform ms access vba

Runtime Error in a dynamic programming code

Menu Driven Program where user inputs string and selects either of 2 patterns to print not compiling. java.lang.ClassNotFoundException error coming

Cant Uninstall Visual C++ Redistributable 2012 to 2022

how to I solve the following exception to sending the email?

I can't solve this NetBeans Exception Error of Ant?

Big troubles with easy multiprocessing code: runtime error (python)

Infinite Loop Error - Runtime error or Logic error?

Reason for conflicting enum values java

SwiftUI Map causes "modifying state during view update"

Python Quick Sort Randomized: Maximum recursion depth exceeded while calling a Python object

Macbook eclipse runs java project but the output is problematic (some outputs are wrong)

Unable to access keycloak console in azure app service - script ssl error

ERRO no speech_recognition python.:Alguem conseugue me ajudar?

Address Sanitizer: Deadly Signal

Error when upgrading goaop/framework module from v2.3.5 to v3.0.0

C++ Runtime Error - "runtime error: addition of unsigned offset to 0x7ffd95c244c0 overflowed to 0x7ffd95c244bf"

Am I misssing something simple with Serialization demo

Run-time error in VBA when trying to use Internet Explorer object

Excel VBA Stack Overflow

cannot gate index of arrival gate of new message in omnet++ 5.6.1

i3status: error while loading shared libraries: /usr/lib/libconfuse.so.2: file too short

Configparser open() Error 2 Positional Arguments given

tutorial_ego file 'World' object has no attribute 'player'

How to calculate large numbers in c++ (large factorials and powers)

Log Internal Error in C# without a try-catch block

In visual Basic: AppConfig keeps giving a "System.NullReferenceException" (As simple a test as possible)

Intermittent Run-time Error 1004 or 13 in Excel 365

Server Tomcat v9.0 Server at localhost failed to start. It's happening in every application I try to run

issue with input in GO

Next.JS: Cannot find module '@emotion/react'

Open Excel worksheet - run time error with other macros

RuntimeError: Not compiled with GPU support - Pytorch pytorch3d

Convolutional neural network throws ErrorTypeError: __init__() takes 1 positional argument but 2 were given

C - Error -1073741819 when trying to run makefile for my sudoku solver

Error in EnsDb.Hsapiens.v86 package to convert ensembl to symbol

ModuleNotFoundError : no module found named <module_name>django

http: runtime error: invalid memory address or nil pointer dereference

RuntimeError: The size of tensor a (4) must match the size of tensor b (2) at non-singleton dimension 0

Donate Button Not working: Unhandled Runtime Error

I'm encountering a Python error when I mix threading, input, and TCP sockets

How to change nginx configuration context URI for odoo

Why excel file cant download at server.?

npm install error while running docker container

Function to calculate days until next birthday in R

TypeError: 'Collection' object is not callable (Error with delete_one)

Hazelcast creates spring beans without dependencies

RuntimeError: dictionary changed size during iteration PYTHON

getting error right after successful login to odoo

visual studio 2022 cannot load any projects - Unsupported project type error

Embedded hazelcast cluster occasionally breaks for no apparent reason

W/System.err(24769): java.lang.IllegalStateException: Reply already submitted | Flutter Stripe Payment

how to solve Microsoft Visual C++ Runtime Library error

MySQL offset and fetch giving syntax error

"Application.Calculation = xlCalculationManual" statement causing run-time error 1004 in VBA Paste procedure

Procedure entry point could not be located in exe

RuntimeError: Given input size: (512x1x3). Calculated output size: (512x0x1). Output size is too small

Corrupted .dll file

C++: Beginning input into a string vector with a punctuation character terminates program, throws 'std::length_error'

Getting 'Uncaught TypeError: handleChange is not a function' while trying to read input from text field

Why my nodeJs Express app is giving me Socket.io Error suddenly? It Was working completely fine till Yeseterday