Can not find file that is in resource folder - java

Can not get file path from resource folder - Java

Can not get file path from resource folder - Java (exception)

Python/Selenium- Class element cannot be clicked

Rerun file not found to execute failed feature scenario in cucumber

Selenium XPath for WebTable using parent & sibling

How to scrape a dynamic website using Python?

How to click on inneHTML String with Selenium?

How to send keys to textarea with selenium, python?

Getting "java.lang.NoClassDefFoundError: Could not initialize class org.openqa.selenium.WebDriverException"

How to find the xpath of a web element already located by selenium?

How Can I run a extension in chrome with selenium c#?

Gmail Log in with Selenium Python does not work

Running WinAppDriver programmatically in TestNG and POM automation framework

Getting a <table> from a website using Selenium and casting its data into a Datatable (c#)

Python Selenium Webelement to Float

How do I save a whatsapp web session in selenium with Mac?

Can not close upload file window in selenium

How to use selenium and hover over li class

constantly checking if new email has arrived using selenium

Chrome headless driver never makes it to website

Finding last message on a discord channel with selenium in python

How to find the title of a element in python selenium

I want to get Image (Captcha) from a site and display it in a Picture Box C#, VB.NET Using Selenium

Don't click the button

TestNG Parallel execution always fails when i run more than one testcase, Among all only one testscript was passing

How to handle load more button in selenium python

How to upload file using selenium java

Is there a way to allow a user to start a crawl themselves when logged in?

How can i handle download firefox dialogbox (accept download and cancel it ) + selenium java

How to target password box at Google login with Python

hi i want to run selenium python script in browser stack and want to check in mobile any one have any solution how we can

python selenium chrome binary

How to pass the request before take screenshot with python?

How to handle OTP popup?

How autologin on a webpage when the fields (username, password) are hidden elements with Selenium

Unable to click and hold on an element on mouse hover

Appium - How to get the text from the Lists of cards that is scrollable with the same xpath

Need help in finding the xpath for webtable based element in below scenario

Please can someone help me with a python code that can scrape Google search results

Enable geolocation in Opera with Java Selenium

How do I get the phone number of gumtree when its hidden

How to get past a cookie agreement page using Python and Selenium?

How to click the button with text Send Me a Push using Selenium and Python?

Selenium Streams - NoSuchElementException

Selenium text retrieval with multiple spaces

How to extract value from the OuterHTMLin python

Python scraping script using selenium to deploy on server and access with API

Is there a way to save and retrieve files while selenium tests are running in Azure Hosted Agent?

OneTimeSetUp: System.ComponentModel.Win32Exception : Not enough memory resources are available to process this command

How to add accessibiity ID in flutter code for appium

java.sql.SQLRecoverableException: IO Error: General SSLEngine problem, connect lapse 331 ms., Authentication lapse 0 ms

Scroll to find element nested inside - Senium with Python (using SeleniumLibrary)

org.openqa.selenium.InvalidArgumentException: invalid argument: user data directoryisalready in use,

'chromedriver' executable needs to be in PATH.' after adding chromedriver to my PATH

How to work with links that use javascript:window.location using Selenium in Python

Errors on automation tests with selenium: "Can't send message, WebSocket status"

Getting next page data through selenium and request

How to solve "undefined method `element_present?' for main:Object (NoMethodError) Ruby Selenium

Cannot access Amazon With Selenium, please Enable Cookies

Timeout exception error scraping with selenium

Python Selenuim - InvalidArgumentExpression: unexpected end of hex escape

Trying to get selenium to access tags from a popup

Web scrapping using selenium in python, trouble in click the button

error: selenium.common.exceptions.TimeoutException: Message:

Html Table data is returning "None"

How to pass a wild card to Katalon Selenium tester?

I don't know if chrome.webRequest.onAuthRequired Listener is actually working

Python Selenium get element by CSS matching text

How to hit the Next button from Python using Selenium?

Need to Load my browser cookies into selenium session

Show window temporarily in Selenium headless mode

How can I accept cookie button once, not three times for the three identical links?

Error: Failed to create session. Unable to create session from "desiredCapabilities":

Problem with multithreading while using different proxies

Access a proxied local webapp from within a docker container

How do I select a button within an angular js element using Selenium webdriver that is only visible when user scrolls or hovers

Existing element can't be found by Selenium

How to access Google drive files from Selenium Webdriver java script, If I have file names and Google drive folder complete URL with folder ID?

Search Through a Dropdown Menu and Select Element Via Text

selenium.common.exceptions.SessionNotCreatedException ,#Anyhelp ASAP#

Using own variable in WebDriverWait. Selenium. Python

Run Selenium Unit Tests in Azure Without CI/CD?

Frequent timeouts when running ChromeDriver locally (Windows)

How to move a file from client to server on Selenium Grid

AttributeError: 'Class' object has no attribute 'rep_call'

Selenium gets stuck in Login phase, even the real browser is already logged in (needs session data)

Jenkins to send custom email which specifies which test failed

Zoom out selenium chrome driver

How to click and select an option from a non select dropdown using Selenium and Java

Empty text from element.getText()

Python selenium -- Chrome gets out of memory every few minutes

How to download files one by one using protractor and wait for each file to download before next download action?

Python Selenium authentication proxy

Python: Change my Automated Browser Timezone

Could not resolve 'light 1em Amazon Ember' as a font."

Do a query with selenium, then click a button from the query results, scrape then get back without having to repeat the query?

Enabling browser logs doesn't work when working with RemoteWebDriver and Selenium

Select Selenium

Unable to scrape image urls